Platform
type: ConceptGroup
type: Collection
member: Terra

MODIS
type: Sensor
type: Concept
broader: Terra
is hosted by: Terra

has instrument

Terra
narrower: MODIS
alternative label: Earth Observation System - Terra
type: Platform
type: Concept
has instrument: MODIS
definition: Terra explores the connections between Earth's atmosphere, land, snow and ice, ocean, and energy balance to understand Earth's climate and climate change and to map the impact of human activity and natural disasters on communities and ecosystems.
source: terra.nasa.gov