Inactive
type: Concept

Active
type: Concept

Metadata Status
member: Inactive
member: Active
in scheme: mmd
definition: Status for the metadata record. This is configuration metadata with the only purpose to determine whether the dataset should be indexed or not.
type: ConceptGroup
type: Collection