Geographical Areas
type: ConceptGroup
type: Collection
member: Norwegian Sea

Norwegian Sea
broader: Arctic
definition: This is used to identify data from the North Sea. Primarily it is used for oceanic observations as well as observations from platforms. It is bordered by the Greenland Sea, the Barents Sea, the North Sea and the Faroe-Iceland ridge. {"Spatial_Coverage": { "Southernmost_latitude": "57.9767651784406", "Northernmost_latitude": "78.1219500577069", "Westernmost_longitude": "-9.02068831025837", "Easternmost_longitude": "27.0790684243223" }}
type: Concept

Arctic
type: Concept
narrower: Norwegian Sea