Platform
type: ConceptGroup
type: Collection
member: Sentinel-2C

Sentinel-2C
type: Platform
source: copernicus-sentinel-2
narrower: MSI
definition: Sentinel-2 is a multispectral operational imaging mission within the GMES (Global Monitoring for Environment and Security) program, jointly implemented by the EC (European Commission) and ESA (European Space Agency) for global land observation (data on vegetation, soil and water cover for land, inland waterways and coastal areas, and also provide atmospheric absorption and distortion data corrections) at high resolution with high revisit capability to provide enhanced continuity of data so far provided by SPOT-5 and Landsat-7
type: Concept
has instrument: MSI

has instrument

MSI
type: Sensor
type: Concept
broader: Sentinel-2C
is hosted by: Sentinel-2C