has instrument

MODIS
type: Sensor
type: Concept
broader: Terra
is hosted by: Terra

Platform
type: ConceptGroup
type: Collection
member: Terra

Terra
type: Platform
type: Concept
source: terra.nasa.gov
alternative label: Earth Observation System - Terra
definition: Terra explores the connections between Earth's atmosphere, land, snow and ice, ocean, and energy balance to understand Earth's climate and climate change and to map the impact of human activity and natural disasters on communities and ecosystems.
narrower: MODIS
has instrument: MODIS