has instrument

VIIRS
type: Sensor
type: Concept
broader: SNPP
is hosted by: SNPP

Platform
type: ConceptGroup
type: Collection
member: SNPP

SNPP
type: Platform
type: Concept
source: index.html
alternative label: Suomi National Polar-orbiting Partnership
definition: Suomi National Polar-orbiting Partnership, formerly known as the NPOESS Preparatory Project, will serve as a bridge between the EOS satellites and the forthcoming series of Joint Polar Satellite System (JPSS) satellites. Suomi NPP represents a critical first step in building this next-generation satellite system. The JPSS satellites, previously called the National Polar-orbiting Operational Environmental Satellite System (NPOESS), will be developed by NASA for the National Oceanic and Atmospheric Administration (NOAA). Suomi NPP will carry five science instruments and test key technologies for the JPSS missions. Suomi NPP is the first satellite mission to address the challenge of acquiring a wide range of land, ocean, and atmospheric measurements for Earth system science while simultaneously preparing to address operational requirements for weather forecasting.
narrower: VIIRS
has instrument: VIIRS