has instrument

AVHRR/3
type: Sensor
type: Concept
broader: Metop-B
is hosted by: Metop-B

Platform
type: ConceptGroup
type: Collection
member: Metop-B

Metop-B
type: Platform
type: Concept
source: About the satellite
alternative label: Meteorological operational satellite - B
definition: The MetOp series, developed by a consortium of European companies led by the main contractor EADS-Astrium, France, builds on the heritage gained from a successful series of European satellites, including the French space agency’s (CNES) SPOT and ESA’s ERS and Envisat. The satellite consists and two modules: the Payload Module (PLM) and the Service Module (SVM), and a large solar array. The PLM accommodates the whole suite of instruments and associated support equipment. MetOp-B was launched on 17 September 2012.
narrower: AVHRR/3
has instrument: AVHRR/3