Metadata Status
type: ConceptGroup
type: Collection
definition: Status for the metadata record. This is configuration metadata with the only purpose to determine whether the dataset should be indexed or not.
in scheme: mmd
member: Inactive
member: Active

Active
type: Concept

Inactive
type: Concept