water_vapor_pressure
note: deprecated
top concept of: Climate and Forecast Standard Names
definition: Vapor pressure is the partial pressure of a constituent of air, such as water, which exists as liquid or solid under 'normal' conditions. 'Water' is specified when the term is being applied to water.
deprecated: true
source: cf-standard-name-table.html
in scheme: Climate and Forecast Standard Names
type: Concept
is replaced by: water_vapor_partial_pressure_in_air

Climate and Forecast Standard Names
type: ConceptScheme
has top concept: water_vapor_pressure

water_vapor_partial_pressure_in_air
type: Concept