Climate and Forecast Standard Names
type: ConceptScheme
has top concept: upward_ocean_mass_transport

upward_ocean_mass_transport
top concept of: Climate and Forecast Standard Names
note: Mapping to be determined
source: cf-standard-name-table.html
in scheme: Climate and Forecast Standard Names
definition: "Upward" indicates a vector component which is positive when directed upward (negative downward).
type: Concept