ultraviolet_index_assuming_overcast_sky
top concept of: Climate and Forecast Standard Names
note: Mapping to be determined
source: cf-standard-name-table.html
in scheme: Climate and Forecast Standard Names
definition: The "Ultraviolet Index" (UVI) is a measure of the amount of solar ultraviolet radiation that reaches the surface of the earth depending on factors such as time of day and cloud cover. It is often used to alert the public of the need to limit sun exposure and use sun creams to protect the skin. Each point on the Index scale is equivalent to 25 mW m-2 of UV radiation (reference: Australian Bureau of Meteorology, http://www.bom.gov.au/uv/about_uv_index.shtml). The UVI range is expressed as a numeric value from 0 to 20 and sometimes graphically as bands of color indicating the attendant risk of skin damage. A UVI of 0-2 is described as 'Low' (represented graphically in green); a UVI of 11 or greater is described as "Extreme" (represented graphically in purple). The higher the UVI, the greater the potential health risk to humans and the less time it takes for harm to occur. A phrase "assuming_condition" indicates that the named quantity is the value which would obtain if all aspects of the system were unaltered except for the assumption of the circumstances specified by the condition. "Overcast" means a fractional sky cover of 95% or more when at least a portion of this amount is attributable to clouds or obscuring phenomena (such as haze, dust, smoke, fog, etc.) aloft. (Reference: AMS Glossary: http://glossary.ametsoc.org/wiki/Main_Page). Standard names are also defined for the quantities ultraviolet_index and ultraviolet_index_assuming_clear_sky.
type: Concept

Climate and Forecast Standard Names
type: ConceptScheme
has top concept: ultraviolet_index_assuming_overcast_sky