Climate and Forecast Standard Names
type: ConceptScheme
has top concept: temperature_of_analysis_of_sea_water

temperature_of_analysis_of_sea_water
top concept of: Climate and Forecast Standard Names
note: Mapping to be determined
source: cf-standard-name-table.html
in scheme: Climate and Forecast Standard Names
definition: The temperature_of_analysis_of_sea_water is the reference temperature for the effects of temperature on the measurement of another variable. This temperature should be measured, but may have been calculated, or assumed. For example, the temperature of the sample when measuring pH, or the temperature of equilibration in the case of dissolved gases. The linkage between the data variable and the variable with a standard_name of temperature_of_analysis_of_sea_water is achieved using the ancillary_variables attribute on the data variable.
type: Concept