Climate and Forecast Standard Names
type: ConceptScheme
has top concept: sea_water_specific_potential_enthalpy

sea_water_specific_potential_enthalpy
top concept of: Climate and Forecast Standard Names
note: Mapping to be determined
source: cf-standard-name-table.html
in scheme: Climate and Forecast Standard Names
definition: The potential enthalpy of a sea water parcel is the specific enthalpy after an adiabatic and isohaline change in pressure from its in situ pressure to the sea pressure p = 0 dbar. "specific" means per unit mass. Reference: www.teos-10.org; McDougall, 2003 doi: 10.1175/1520-0485(2003)033<0945:PEACOV>2.0.CO;2.
type: Concept