sea_water_reference_salinity
top concept of: Climate and Forecast Standard Names
note: Mapping to be determined
source: cf-standard-name-table.html
in scheme: Climate and Forecast Standard Names
definition: If a sea water sample has the Reference Composition (defined in Millero et al., 2008), then its Reference Salinity is the best available estimate of its Absolute Salinity. For general purposes, Reference Salinity is (35.16504 g kg-1)/35 times Practical Salinity. Reference: www.teos-10.org; Millero et al., 2008 doi: 10.1016/j.dsr.2007.10.001. There are also standard names for the precisely defined salinity quantities sea_water_knudsen_salinity, S_K (used for salinity observations between 1901 and 1966), sea_water_cox_salinity, S_C (used for salinity observations between 1967 and 1977), sea_water_practical_salinity (used for salinity observations from 1978 onwards), sea_water_absolute_salinity, S_A, and sea_water_preformed_salinity, S_*. Salinity quantities that do not match any of the precise definitions should be given the more general standard name of sea_water_salinity.
type: Concept

Climate and Forecast Standard Names
type: ConceptScheme
has top concept: sea_water_reference_salinity