Climate and Forecast Standard Names
type: ConceptScheme
has top concept: sea_water_redistributed_potential_temperature

sea_water_redistributed_potential_temperature
top concept of: Climate and Forecast Standard Names
note: Mapping to be determined
source: cf-standard-name-table.html
in scheme: Climate and Forecast Standard Names
definition: The quantity with standard name sea_water_redistributed_potential_temperature is a passive tracer in an ocean model which is subject to an externally imposed perturbative surface heat flux. The passive tracer is initialised to the potential temperature in the control climate before the perturbation is imposed. Its surface flux is the heat flux from the atmosphere, not including the imposed perturbation, and is converted to a passive tracer increment as if it were being added to potential temperature. The passive tracer is transported within the ocean as if it were potential temperature. The passive tracer records redistributed heat, as described for the CMIP6 FAFMIP experiment (doi:10.5194/gmd-9-3993-2016), following earlier ideas. Potential temperature is the temperature a parcel of air or sea water would have if moved adiabatically to sea level pressure.
type: Concept