Climate and Forecast Standard Names
type: ConceptScheme
has top concept: sea_water_potential_temperature_at_sea_floor

sea_water_potential_temperature_at_sea_floor
top concept of: Climate and Forecast Standard Names
note: Mapping to be determined
source: cf-standard-name-table.html
in scheme: Climate and Forecast Standard Names
definition: Potential temperature is the temperature a parcel of air or sea water would have if moved adiabatically to sea level pressure. The potential temperature at the sea floor is that adjacent to the ocean bottom, which would be the deepest grid cell in an ocean model and within the benthic boundary layer for measurements.
type: Concept