Climate and Forecast Standard Names
type: ConceptScheme
has top concept: sea_surface_wave_yy_radiation_stress

sea_surface_wave_yy_radiation_stress
top concept of: Climate and Forecast Standard Names
note: Mapping to be determined
source: cf-standard-name-table.html
in scheme: Climate and Forecast Standard Names
definition: "Sea surface wave radiation stress" describes the excess momentum flux caused by sea surface waves. Radiation stresses behave as a second-order tensor. "yy" indicates the component of the tensor along the grid y_ axis.
type: Concept