sea_surface_wave_period_of_highest_wave
top concept of: Climate and Forecast Standard Names
source: cf-standard-name-table.html
in scheme: Climate and Forecast Standard Names
definition: Wave period of the highest wave is the period determined from wave crests corresponding to the greatest vertical distance above mean level during the observation period. A period is an interval of time, or the time-period of an oscillation. Wave period is the interval of time between repeated features on the waveform such as crests, troughs or upward passes through the mean level.
type: Concept

Climate and Forecast Standard Names
type: ConceptScheme
has top concept: sea_surface_wave_period_of_highest_wave