Climate and Forecast Standard Names
type: ConceptScheme
has top concept: sea_surface_swell_wave_zero_upcrossing_period

sea_surface_swell_wave_mean_period
type: Concept

sea_surface_swell_wave_zero_upcrossing_period
note: deprecated
in scheme: Climate and Forecast Standard Names
definition: A period is an interval of time, or the time-period of an oscillation. The zero upcrossing period is defined as the time interval between consecutive occasions on which the surface height passes upward above the mean level. Swell waves are waves on the ocean surface.
source: cf-standard-name-table.html
deprecated: true
type: Concept
top concept of: Climate and Forecast Standard Names
is replaced by: sea_surface_swell_wave_mean_period