Climate and Forecast Standard Names
type: ConceptScheme
has top concept: sea_surface_skin_temperature

sea_surface_skin_temperature
top concept of: Climate and Forecast Standard Names
note: Mapping to be determined
source: cf-standard-name-table.html
in scheme: Climate and Forecast Standard Names
definition: The sea surface skin temperature is the temperature measured by an infrared radiometer typically operating at wavelengths in the range 3.7 - 12 micrometers. It represents the temperature within the conductive diffusion-dominated sub-layer at a depth of approximately 10 - 20 micrometers below the air-sea interface. Measurements of this quantity are subject to a large potential diurnal cycle including cool skin layer effects (especially at night under clear skies and low wind speed conditions) and warm layer effects in the daytime.
type: Concept