sea_ice_draft
top concept of: Climate and Forecast Standard Names
source: cf-standard-name-table.html
in scheme: Climate and Forecast Standard Names
definition: Sea ice draft is the depth of the sea-ice lower surface below the water surface. "Sea ice" means all ice floating in the sea which has formed from freezing sea water, rather than by other processes such as calving of land ice to form icebergs.
type: Concept

Climate and Forecast Standard Names
type: ConceptScheme
has top concept: sea_ice_draft