Climate and Forecast Standard Names
type: ConceptScheme
has top concept: sea_ice_basal_temperature

sea_ice_basal_temperature
top concept of: Climate and Forecast Standard Names
note: Mapping to be determined
source: cf-standard-name-table.html
in scheme: Climate and Forecast Standard Names
definition: "Sea ice" means all ice floating in the sea which has formed from freezing sea water, rather than by other processes such as calving of land ice to form icebergs. The standard name sea_ice_basal_temperature means the temperature of the sea ice at its lower boundary.
type: Concept