platform_yaw_rate_fore_port
top concept of: Climate and Forecast Standard Names
note: Mapping to be determined
source: cf-standard-name-table.html
in scheme: Climate and Forecast Standard Names
definition: "Yaw rate" is the rate of rotation about the local vertical axis. Yaw rate might not include changes to the "at rest" rotation of the platform with respect to the axis of rotation, which may change over time. "Fore port" indicates that positive values of yaw rate represent the front of the platform moving to the left as viewed by an observer on top of the platform facing forward. The standard name platform_yaw_rate_fore_starboard should be used for data having the opposite sign convention. The standard name platform_yaw_rate should be chosen only if the sign convention of the data is unknown. A "platform" is a structure or vehicle that serves as a base for mounting sensors. Platforms include, but are not limited to, satellites, aeroplanes, ships, buoys, instruments, ground stations, and masts.
type: Concept

Climate and Forecast Standard Names
type: ConceptScheme
has top concept: platform_yaw_rate_fore_port