Climate and Forecast Standard Names
type: ConceptScheme
has top concept: ocean_volume_x_transport

ocean_volume_x_transport
top concept of: Climate and Forecast Standard Names
note: Mapping to be determined
source: cf-standard-name-table.html
in scheme: Climate and Forecast Standard Names
definition: "x" indicates a vector component along the grid x-axis, positive with increasing x.
type: Concept