ocean_volume_transport_across_line
top concept of: Climate and Forecast Standard Names
note: Mapping to be determined
source: cf-standard-name-table.html
in scheme: Climate and Forecast Standard Names
definition: Transport "across_line" means that which crosses a particular line on the Earth's surface; formally this means the integral along the line of the normal component of the transport.
type: Concept

Climate and Forecast Standard Names
type: ConceptScheme
has top concept: ocean_volume_transport_across_line