Climate and Forecast Standard Names
type: ConceptScheme
has top concept: ocean_meridional_overturning_streamfunction

ocean_meridional_overturning_streamfunction
top concept of: Climate and Forecast Standard Names
note: Mapping to be determined
source: cf-standard-name-table.html
in scheme: Climate and Forecast Standard Names
definition: The ocean meridional overturning streamfunction should not include not include the parameterized eddy advection velocity.
type: Concept