ocean_heat_y_transport_due_to_diffusion
top concept of: Climate and Forecast Standard Names
note: Mapping to be determined
source: cf-standard-name-table.html
in scheme: Climate and Forecast Standard Names
definition: "y" indicates a vector component along the grid y-axis, positive with increasing y. The specification of a physical process by the phrase due_to_process means that the quantity named is a single term in a sum of terms which together compose the general quantity named by omitting the phrase.
type: Concept

Climate and Forecast Standard Names
type: ConceptScheme
has top concept: ocean_heat_y_transport_due_to_diffusion