Climate and Forecast Standard Names
type: ConceptScheme
has top concept: number_concentration_of_ozone_molecules_in_air

number_concentration_of_ozone_molecules_in_air
top concept of: Climate and Forecast Standard Names
note: Mapping to be determined
source: cf-standard-name-table.html
in scheme: Climate and Forecast Standard Names
definition: "Number concentration" means the number of particles or other specified objects per unit volume. The chemical formula for ozone is O3. The IUPAC name for ozone is trioxygen.
type: Concept