Climate and Forecast Standard Names
type: ConceptScheme
has top concept: northward_atmosphere_heat_transport

northward_atmosphere_heat_transport
top concept of: Climate and Forecast Standard Names
note: Mapping to be determined
source: cf-standard-name-table.html
in scheme: Climate and Forecast Standard Names
definition: 'Northward' indicates a vector component which is positive when directed northward (negative southward). 'Atmosphere heat transport' means total heat transport by the atmosphere by all processes.
type: Concept