Climate and Forecast Standard Names
type: ConceptScheme
has top concept: nitrogen_mass_flux_into_soil_from_litter

nitrogen_mass_flux_into_soil_from_litter
top concept of: Climate and Forecast Standard Names
note: Mapping to be determined
source: cf-standard-name-table.html
in scheme: Climate and Forecast Standard Names
definition: In accordance with common usage in geophysical disciplines, "flux" implies per unit area, called "flux density" in physics. "Litter" is dead plant material in or above the soil.
type: Concept