Climate and Forecast Standard Names
type: ConceptScheme
has top concept: mass_fraction_of_cfc12_in_air

mass_fraction_of_cfc12_in_air
top concept of: Climate and Forecast Standard Names
note: Mapping to be determined
source: cf-standard-name-table.html
in scheme: Climate and Forecast Standard Names
definition: "Mass fraction" is used in the construction "mass_fraction_of_X_in_Y", where X is a material constituent of Y. It means the ratio of the mass of X to the mass of Y (including X). A chemical or biological species denoted by X may be described by a single term such as "nitrogen" or a phrase such as "nox_expressed_as_nitrogen". The chemical formula for CFC12 is CF2Cl2. The IUPAC name for CFC12 is dichloro(difluoro)methane.
type: Concept