Climate and Forecast Standard Names
type: ConceptScheme
has top concept: lwe_precipitation_rate

lwe_precipitation_rate
top concept of: Climate and Forecast Standard Names
note: Mapping to be determined
source: cf-standard-name-table.html
in scheme: Climate and Forecast Standard Names
definition: "Precipitation" in the earth's atmosphere means precipitation of water in all phases. The abbreviation "lwe" means liquid water equivalent. "Precipitation rate" means the depth or thickness of the layer formed by precipitation per unit time.
type: Concept