longitude
top concept of: Climate and Forecast Standard Names
note: Mapping to be determined
source: cf-standard-name-table.html
in scheme: Climate and Forecast Standard Names
definition: Longitude is positive eastward; its units of degree_east (or equivalent) indicate this explicitly. In a latitude-longitude system defined with respect to a rotated North Pole, the standard name of grid_longitude should be used instead of longitude. Grid longitude is positive in the grid-eastward direction, but its units should be plain degree.
type: Concept

Climate and Forecast Standard Names
type: ConceptScheme
has top concept: longitude