Climate and Forecast Standard Names
type: ConceptScheme
has top concept: isotropic_shortwave_radiance_in_air

isotropic_shortwave_radiance_in_air
replaces: shortwave radiance
top concept of: Climate and Forecast Standard Names
note: Mapping to be determined
source: cf-standard-name-table.html
in scheme: Climate and Forecast Standard Names
definition: 'shortwave' means shortwave radiation. Radiance is the radiative flux in a particular direction, per unit of solid angle. If radiation is isotropic, the radiance is independent of direction, so the direction should not be specified. If the radiation is directionally dependent, a standard name of upwelling or downwelling radiance should be chosen instead.
type: Concept