Climate and Forecast Standard Names
type: ConceptScheme
has top concept: humidity_mixing_ratio

humidity_mixing_ratio
top concept of: Climate and Forecast Standard Names
source: cf-standard-name-table.html
in scheme: Climate and Forecast Standard Names
definition: Humidity mixing ratio of a parcel of moist air is the ratio of the mass of water vapor to the mass of dry air.
type: Concept