Climate and Forecast Standard Names
type: ConceptScheme
has top concept: halosteric_change_in_mean_sea_level

halosteric_change_in_mean_sea_level
top concept of: Climate and Forecast Standard Names
note: Mapping to be determined
source: cf-standard-name-table.html
in scheme: Climate and Forecast Standard Names
definition: Halosteric sea level change is the part caused by change in sea water density due to change in salinity. "Mean sea level" means the time mean of sea surface elevation at a given location over an arbitrary period sufficient to eliminate the tidal signals. Zero mean sea level change is an arbitrary level. The sum of the quantities with standard names thermosteric_change_in_mean_sea_level and halosteric_change_in_mean_sea_level has the standard name steric_change_in_mean_sea_level.
type: Concept