Climate and Forecast Standard Names
type: ConceptScheme
has top concept: electrical_mobility_diameter_of_ambient_aerosol_particles

electrical_mobility_diameter_of_ambient_aerosol_particles
replaces: electrical mobility particle diameter
top concept of: Climate and Forecast Standard Names
note: Mapping to be determined
source: cf-standard-name-table.html
in scheme: Climate and Forecast Standard Names
definition: The diameter of an aerosol particle as selected by its electrical mobility. "Aerosol" means the system of suspended liquid or solid particles in air (except cloud droplets) and their carrier gas, the air itself. "Ambient_aerosol" means that the aerosol is measured or modelled at the ambient state of pressure, temperature and relative humidity that exists in its immediate environment. "Ambient aerosol particles" are aerosol particles that have taken up ambient water through hygroscopic growth. The extent of hygroscopic growth depends on the relative humidity and the composition of the particles. To specify the relative humidity and temperature at which the quantity described by the standard name applies, provide scalar coordinate variables with standard names of "relative_humidity" and "air_temperature".
type: Concept