Climate and Forecast Standard Names
type: ConceptScheme
has top concept: eastward_transformed_eulerian_mean_velocity

eastward_transformed_eulerian_mean_air_velocity
type: Concept

eastward_transformed_eulerian_mean_velocity
in scheme: Climate and Forecast Standard Names
deprecated: true
top concept of: Climate and Forecast Standard Names
note: deprecated
is replaced by: eastward_transformed_eulerian_mean_air_velocity
source: cf-standard-name-table.html
definition: Eastward indicates a vector component which is positive when directed eastward (negative westward).
type: Concept