Climate and Forecast Standard Names
type: ConceptScheme
has top concept: eastward_transformed_eulerian_mean_air_velocity

eastward_transformed_eulerian_mean_air_velocity
replaces: eastward transformed eulerian mean velocity
top concept of: Climate and Forecast Standard Names
note: Mapping to be determined
source: cf-standard-name-table.html
in scheme: Climate and Forecast Standard Names
definition: "Eastward" indicates a vector component which is positive when directed eastward (negative westward). The "Transformed Eulerian Mean" refers to a formulation of the mean equations which incorporates some eddy terms into the definition of the mean, described in Andrews et al (1987): Middle Atmospheric Dynamics. Academic Press.
type: Concept