Climate and Forecast Standard Names
type: ConceptScheme
has top concept: downward_y_stress_at_sea_ice_base

downward_y_stress_at_sea_ice_base
top concept of: Climate and Forecast Standard Names
note: Mapping to be determined
source: cf-standard-name-table.html
in scheme: Climate and Forecast Standard Names
definition: "y" indicates a vector component along the grid y-axis, positive with increasing y. "Downward" indicates a vector component which is positive when directed downward (negative upward). "Sea ice" means all ice floating in the sea which has formed from freezing sea water, rather than by other processes such as calving of land ice to form icebergs.
type: Concept