Climate and Forecast Standard Names
type: ConceptScheme
has top concept: downward_air_velocity

downward_air_velocity
top concept of: Climate and Forecast Standard Names
note: Mapping to be determined
source: cf-standard-name-table.html
in scheme: Climate and Forecast Standard Names
definition: A velocity is a vector quantity."Downward" indicates a vector component which is positive when directed downward (negative upward). Downward air velocity is the vertical component of the 3D air velocity vector. The standard name upward_air_velocity may be used for a vector component with the opposite sign convention.
type: Concept