divergence_of_sea_ice_velocity
top concept of: Climate and Forecast Standard Names
note: Mapping to be determined
source: cf-standard-name-table.html
in scheme: Climate and Forecast Standard Names
definition: The phrase "[horizontal_]divergence_of_X" means [horizontal] divergence of a vector X; if X does not have a vertical component then "horizontal" should be omitted. A velocity is a vector quantity. Sea ice velocity is defined as a two-dimensional vector, with no vertical component. "Sea ice" means all ice floating in the sea which has formed from freezing sea water, rather than by other processes such as calving of land ice to form icebergs.
type: Concept

Climate and Forecast Standard Names
type: ConceptScheme
has top concept: divergence_of_sea_ice_velocity