Climate and Forecast Standard Names
type: ConceptScheme
has top concept: distance_from_geocenter

distance_from_geocenter
top concept of: Climate and Forecast Standard Names
note: Mapping to be determined
source: cf-standard-name-table.html
in scheme: Climate and Forecast Standard Names
definition: A measure of distance from the Earth's geocenter, commonly used in satellite tracks.
type: Concept