direction_of_swell_wave_velocity
in scheme: Climate and Forecast Standard Names
note: deprecated
source: cf-standard-name-table.html
top concept of: Climate and Forecast Standard Names
type: Concept
is replaced by: sea_surface_swell_wave_to_direction
definition: Swell waves are waves on the ocean surface. 'to_direction' is used in the construction X_to_direction and indicates the direction towards which the velocity vector of X is headed.
deprecated: true

Climate and Forecast Standard Names
type: ConceptScheme
has top concept: direction_of_swell_wave_velocity

sea_surface_swell_wave_to_direction
type: Concept