Climate and Forecast Standard Names
type: ConceptScheme
has top concept: direction_of_sea_water_velocity

sea_water_velocity_to_direction
type: Concept

direction_of_sea_water_velocity
source: cf-standard-name-table.html
in scheme: Climate and Forecast Standard Names
definition: 'direction_of_X' means direction of a vector, a bearing. A velocity is a vector quantity.
deprecated: true
note: deprecated
top concept of: Climate and Forecast Standard Names
type: Concept
is replaced by: sea_water_velocity_to_direction