Climate and Forecast Standard Names
type: ConceptScheme
has top concept: change_over_time_in_sea_water_density

change_over_time_in_sea_water_density
top concept of: Climate and Forecast Standard Names
note: Mapping to be determined
source: cf-standard-name-table.html
in scheme: Climate and Forecast Standard Names
definition: Sea water density is the in-situ density (not the potential density). If 1000 kg m-3 is subtracted, the standard name "sea_water_sigma_t" should be chosen instead. "change_over_time_in_X" means change in a quantity X over a time-interval, which should be defined by the bounds of the time coordinate.
type: Concept