change_in_land_ice_mass
top concept of: Climate and Forecast Standard Names
note: Mapping to be determined
source: cf-standard-name-table.html
in scheme: Climate and Forecast Standard Names
definition: Zero change in land ice mass is an arbitrary level. "Land ice" means glaciers, ice-caps and ice-sheets resting on bedrock and also includes ice-shelves. The horizontal domain over which the quantity is calculated is described by the associated coordinate variables and coordinate bounds or by a coordinate variable or scalar coordinate variable with the standard name of "region" supplied according to section 6.1.1 of the CF conventions.
type: Concept

Climate and Forecast Standard Names
type: ConceptScheme
has top concept: change_in_land_ice_mass