biomass_burning_carbon_flux
top concept of: Climate and Forecast Standard Names
note: Mapping to be determined
source: cf-standard-name-table.html
in scheme: Climate and Forecast Standard Names
definition: 'Biomass burning carbon' refers to the rate at which biomass is burned by forest fires etc., expressed as the mass of carbon which it contains. In accordance with common usage in geophysical disciplines, 'flux' implies per unit area, called 'flux density' in physics.
type: Concept

Climate and Forecast Standard Names
type: ConceptScheme
has top concept: biomass_burning_carbon_flux