Climate and Forecast Standard Names
type: ConceptScheme
has top concept: atmosphere_hybrid_sigma_pressure_coordinate

atmosphere_hybrid_sigma_pressure_coordinate
top concept of: Climate and Forecast Standard Names
note: Mapping to be determined
source: cf-standard-name-table.html
in scheme: Climate and Forecast Standard Names
definition: See Appendix D of the CF convention for information about parametric vertical coordinates.
type: Concept