Climate and Forecast Standard Names
type: ConceptScheme
has top concept: wood_debris_mass_content_of_nitrogen

wood_debris_mass_content_of_nitrogen
type: Concept
top concept of: Climate and Forecast Standard Names
note: Mapping to be determined
source: cf-standard-name-table.html
in scheme: Climate and Forecast Standard Names
definition: "Content" indicates a quantity per unit area. "Wood debris" means dead organic matter composed of coarse wood. It is distinct from fine litter. The precise distinction between "fine" and "coarse" is model dependent. The sum of the quantities with standard names wood_debris_mass_content_of_nitrogen, surface_litter_mass_content_of_nitrogen and subsurface_litter_mass_content_of_nitrogen is the total nitrogen mass content of dead plant material.